[Date Prev][Date Next][Thread Prev][Thread Next][Date Index][Thread Index]

[bluetooth-dev] Compilation Error



Hi,

i just install the readline library, but i still have another error:

make[2]: Entering directory `/home/eecow/openbt/apps/bluetooth/userstack'
cc  -pthread  btd.o btdebug.o btmem.o hci.o l2cap.o l2cap_con.o rfcomm.o 
sdp.o tcs.o test.o bt_proc.o hci_vendor.o sec_client.o l2cap_sec.o 
rfcomm_sec.o -lutil  -lreadline -ltermcap -o btduser
/usr/bin/ld: cannot find -ltermcap
collect2: ld returned 1 exit status
make[3]: *** [btduser] Error 1
make[2]: *** [all] Error 2
make[2]: Leaving directory `/home/eecow/openbt/apps/bluetooth/userstack'
make[1]: *** [all-recurse] Error 1
make[1]: Leaving directory `/home/eecow/openbt/apps/bluetooth'
make: *** [all] Error 2
[root@eecow openbt]#

it seems that i need termcap rpm or something, i try to download this:
termcap-11.0.1-4mdk.i586.rpm

but when i click it to install, it says, i have this already.

What should I do?
i try to comment some lines about using -ltermcap.
But the btu.c in userstack directory gives me lots of unreference error.

can anyone please teach me?

Thanks,
Victor


-
To unsubscribe from this list: send the line "unsubscribe bluetooth-dev" in
the body of a message to majordomo@xxxxxxx.com