[Date Prev][Date Next][Thread Prev][Thread Next][Date Index][Thread Index]

Problems with installing DevBoard82 Software



Hi,

I have problems with installing the Dev. Board 82 Software:

- I installed the cris compiler cris-dist-1.25-1.i386.rpm with rpm
- tar -zxvf .../devboard_82-R1_90.tgz in my home directory
- tar -zxvf .../linux-2.4.20.tar.gz in ../axis/devboard_82/os

but after running ./install in /axis/devboard_82/ I got following errors 
(patching finished with no errors):

......
Making install in apps/web/boa for cris-axis-linux-gnu
make[1]: Entering directory `/home/tom/axis/devboard_82/apps/web/boa'
Making install in src for cris-axis-linux-gnu
make[2]: Entering directory `/home/tom/axis/devboard_82/apps/web/boa/src'
bison -y -d boa_grammar.y
gcc-cris  -isystem 
/home/tom/axis/devboard_82/target/cris-axis-linux-gnu/include -mlinux -Wall 
-Wshadow -O2 -g -Wall -g 
-I/home/tom/axis/devboard_82/target/cris-axis-linux-gnu/include -DTRANSFER  
-DBASIC_AUTH  -c -o y.tab.o y.tab.c
boa_grammar.y:29:2: warning: '/*' within comment
y.tab.c: In function `yyparse':
y.tab.c:872: warning: implicit declaration of function `yylex'
boa_grammar.y:81: `NULL' undeclared (first use in this function)
boa_grammar.y:81: (Each undeclared identifier is reported only once
boa_grammar.y:81: for each function it appears in.)
boa_grammar.y:95: warning: implicit declaration of function `strdup'
boa_grammar.y:95: warning: assignment makes pointer from integer without a 
cast
boa_grammar.y:102: warning: implicit declaration of function `free'
make[2]: *** [y.tab.o] Fehler 1
make[2]: Leaving directory `/home/tom/axis/devboard_82/apps/web/boa/src'
make[1]: *** [install-recurse] Fehler 1
make[1]: Leaving directory `/home/tom/axis/devboard_82/apps/web/boa'
make: *** [install-recurse] Fehler 1


My host runs under Linux version 2.4.20-4GB-athlon (root@xxxxxxx.de) (gcc 
version 3.3 20030226 (prerelease) (SuSE Linux))

How to work around, any ideas?

Thanks for help,

Thomas