[Date Prev][Date Next][Thread Prev][Thread Next][Date Index][Thread Index]

Re: AW: Problems with installing DevBoard82 Software



Hi Martin,

> I solved them by adding the following packages to my installation (beside
> the packages listed under "Requirements" in the install-howto):
> - ncurses-devel
> - zlib-devel
> - byacc does not exist in SuSE, so add byacc as a symbolic link to yacc

I checked all req	uirements as listed in How to Install the Developer Board 82 
Software (bison included) but the install script ends with the same errors:

....
make[2]: Entering directory `/home/tom/axis/devboard_82/apps/web/boa/src'
gcc-cris  -isystem 
/home/tom/axis/devboard_82/target/cris-axis-linux-gnu/include -mlinux -Wall 
-Wshadow -O2 -g -Wall -g 
-I/home/tom/axis/devboard_82/target/cris-axis-linux-gnu/include -DTRANSFER  
-DBASIC_AUTH  -c -o y.tab.o y.tab.c
boa_grammar.y:29:2: warning: '/*' within comment
y.tab.c: In function `yyparse':
y.tab.c:872: warning: implicit declaration of function `yylex'
boa_grammar.y:81: `NULL' undeclared (first use in this function)
boa_grammar.y:81: (Each undeclared identifier is reported only once
boa_grammar.y:81: for each function it appears in.)
boa_grammar.y:95: warning: implicit declaration of function `strdup'
boa_grammar.y:95: warning: assignment makes pointer from integer without a 
cast
boa_grammar.y:102: warning: implicit declaration of function `free'
make[2]: *** [y.tab.o] Fehler 1
make[2]: Leaving directory `/home/tom/axis/devboard_82/apps/web/boa/src'
make[1]: *** [install-recurse] Fehler 1
make[1]: Leaving directory `/home/tom/axis/devboard_82/apps/web/boa'
make: *** [install-recurse] Fehler 1

How to avoid this errors??
The error messages appear also after make install (top level makefile). 

I created a kimage and start the ktest script (both without errors) to copy 
the image to the Dev.board, but after that the board was not reachable by 
ethernet (arp -s 192.168.0.90 00:40:..... and ping 192.168.0.90).

Has this to do with the errors after ./install or is there another reason?

Thanks!
Thomas

>
> In my install-howto version "bison" was also missing as a requirement, but
> in the current version it is yet added.
>
> Good luck!
> Martin
>
> > -----Ursprungliche Nachricht-----
> > Von: owner-dev-etrax@xxxxxxx.com]Im">mailto:owner-dev-etrax@xxxxxxx.com]Im
> > Auftrag von Thomas Brehm
> > Gesendet: Dienstag, 27. Mai 2003 11:52
> > An: dev-etrax@xxxxxxx.com
> > Betreff: Problems with installing DevBoard82 Software
> >
> >
> > Hi,
> >
> > I have problems with installing the Dev. Board 82 Software:
> >
> > - I installed the cris compiler cris-dist-1.25-1.i386.rpm with rpm
> > - tar -zxvf .../devboard_82-R1_90.tgz in my home directory
> > - tar -zxvf .../linux-2.4.20.tar.gz in ../axis/devboard_82/os
> >
> > but after running ./install in /axis/devboard_82/ I got following errors
> > (patching finished with no errors):
> >
> > ......
> > Making install in apps/web/boa for cris-axis-linux-gnu
> > make[1]: Entering directory `/home/tom/axis/devboard_82/apps/web/boa'
> > Making install in src for cris-axis-linux-gnu
> > make[2]: Entering directory `/home/tom/axis/devboard_82/apps/web/boa/src'
> > bison -y -d boa_grammar.y
> > gcc-cris  -isystem
> > /home/tom/axis/devboard_82/target/cris-axis-linux-gnu/include
> > -mlinux -Wall
> > -Wshadow -O2 -g -Wall -g
> > -I/home/tom/axis/devboard_82/target/cris-axis-linux-gnu/include
> > -DTRANSFER
> > -DBASIC_AUTH  -c -o y.tab.o y.tab.c
> > boa_grammar.y:29:2: warning: '/*' within comment
> > y.tab.c: In function `yyparse':
> > y.tab.c:872: warning: implicit declaration of function `yylex'
> > boa_grammar.y:81: `NULL' undeclared (first use in this function)
> > boa_grammar.y:81: (Each undeclared identifier is reported only once
> > boa_grammar.y:81: for each function it appears in.)
> > boa_grammar.y:95: warning: implicit declaration of function `strdup'
> > boa_grammar.y:95: warning: assignment makes pointer from integer
> > without a
> > cast
> > boa_grammar.y:102: warning: implicit declaration of function `free'
> > make[2]: *** [y.tab.o] Fehler 1
> > make[2]: Leaving directory `/home/tom/axis/devboard_82/apps/web/boa/src'
> > make[1]: *** [install-recurse] Fehler 1
> > make[1]: Leaving directory `/home/tom/axis/devboard_82/apps/web/boa'
> > make: *** [install-recurse] Fehler 1
> >
> >
> > My host runs under Linux version 2.4.20-4GB-athlon
> > (root@xxxxxxx.de) (gcc
> > version 3.3 20030226 (prerelease) (SuSE Linux))
> >
> > How to work around, any ideas?
> >
> > Thanks for help,
> >
> > Thomas