[Date Prev][Date Next][Thread Prev][Thread Next][Date Index][Thread Index]

Re: Newbie question: ktest and flashit




----- Original Message -----
From: <u9900670@xxxxxxx.fi>
To: <dev-etrax@xxxxxxx.com>
Sent: den 25 september 2003 22:55
Subject: Newbie question: ktest and flashit


>
> I would like to use ktest and flashit scripts to get (and test) my
> application on
> Developer Board (Etrax 100LX). By using FTP and Telnet it works fine.
>
> I'm using:
> SuSE 8.2, (kernelversion 2.4.20)
> devboard_lx-R2_1_0
> cris-dist-glibc_1.25
> cris-dist-1.25
> linux-2.4.14
>
> I followed the instructions on the document "How to Write and Build
> Applications"
>
> Before installing I remembered to make: source ./init_env
>
> However after calling 'make install' I get this error message:
>
>
> /home/jarmov/Axis_/axis/devboard_lx/apps/shells/ash/debian/bsdyacc: line
16:
> byacc: command not found

You need to install byacc.

> make[1]: *** [arith.c] Error 127
> make[1]: Leaving directory
> `/home/jarmov/Axis_/axis/devboard_lx/apps/shells/ash'
> make: *** [install-recurse] Error 1
> dasee2993:/home/jarmov/Axis_/axis/devboard_lx #
>
> Well, I still tried to call 'make images', but the result is:
>
> cat /home/jarmov/Axis_/axis/devboard_lx/os/linux/vmlinux.bin cramfs.img >
> kimage
> *** Creating flash2.img
> mkfs.jffs -r -d
> /home/jarmov/Axis_/axis/devboard_lx/target/cris-axis-linux-gnu/mnt/flash >
> flash2.img
> /bin/sh: line 1: mkfs.jffs: command not found
> make: *** [fimage] Error 127
> dasee2993:/home/jarmov/Axis_/axis/devboard_lx #
>
> If you have any suggestions or advice what should I do and check, please
> let me
> know.

Did you do just 'make' or 'make tools' before you did make install?


> Thanks,
> Jarmo

/Johan