[Date Prev][Date Next][Thread Prev][Thread Next][Date Index][Thread Index]

SAME mistake in R1_91 as in R1_90! (was Re: New Devboard 82/83 SDKrelease)



Hej!

Anders Torbjorn Johansson wrote on 01.12.2003 14:54 MET:
> Release 1_91 of the devboard 82/83 SDK is now available at developer.axis.com. 
> The release includes a new patch for the 2.4.22 kernel with the latest USB
> driver. It also include some minor updates to the applications.

Sorry guys and girls, you did release R1_91 with the same error as R1_91.

Could you please apply the patch
   ftp://ftp.fl.priv.at/pub/axis/devboard_82/patches/R1_90/patch-01-boa
to R1_91.

Here the output of a fresh downloaded R1_91:
gcc-cris  -isystem /home/fl/axis/devboard_82/target/cris-axis-linux-gnu/include -mlinux -Wall -Wshadow -O2 -g -Wall -g -I/home/fl/axis/devboard_82/target/cris-axis-linux-gnu/include -DTRANSFER  -DBASIC_AUTH  -c -o y.tab.o y.tab.c
boa_grammar.y:29:1: warning: "/*" within comment
y.tab.c: In function `yyparse':
y.tab.c:872: warning: implicit declaration of function `yylex'
boa_grammar.y:81: `NULL' undeclared (first use in this function)
boa_grammar.y:81: (Each undeclared identifier is reported only once
boa_grammar.y:81: for each function it appears in.)
boa_grammar.y:95: warning: implicit declaration of function `strdup'
boa_grammar.y:95: warning: assignment makes pointer from integer without a cast
boa_grammar.y:102: warning: implicit declaration of function `free'
boa_grammar.y:114: warning: implicit declaration of function `strcpy'
make[3]: *** [y.tab.o] Fehler 1
make[3]: Leaving directory `/opt/develop/axis/devboard_82/apps/web/boa/src'
make[2]: *** [install-recurse] Fehler 1
make[2]: Leaving directory `/opt/develop/axis/devboard_82/apps/web/boa'
make[1]: *** [install-recurse] Fehler 1
make[1]: Leaving directory `/opt/develop/axis/devboard_82'
make: *** [everything] Fehler 2

AFTER applying the patch:
bison -y -d boa_grammar.y
gcc-cris  -isystem /home/fl/axis/devboard_82/target/cris-axis-linux-gnu/include -mlinux -Wall -Wshadow -O2 -g -Wall -g -I/home/fl/axis/devboard_82/target/cris-axis-linux-gnu/include -DTRANSFER  -DBASIC_AUTH  -c -o y.tab.o y.tab.c
y.tab.c: In function `yyparse':
y.tab.c:873: warning: implicit declaration of function `yylex'
flex boa_lexer.l
gcc-cris  -isystem /home/fl/axis/devboard_82/target/cris-axis-linux-gnu/include -mlinux -Wall -Wshadow -O2 -g -Wall -g -I/home/fl/axis/devboard_82/target/cris-axis-linux-gnu/include -DTRANSFER  -DBASIC_AUTH  -c -o lex.yy.o lex.yy.c
boa_lexer.l: In function `yylex':
boa_lexer.l:82: warning: implicit declaration of function `yyerror'
lex.yy.c: At top level:
....and so on...till the compile finishes successful.

-- 
MfG / Regards
Friedrich Lobenstock