[Date Prev][Date Next][Thread Prev][Thread Next][Date Index][Thread Index]

Devboard 82 R1.92



Hi,

I can't compile the Devboard82 SDK (R 1.92) tools (using gcc-cris 1.56).
It seems that the problem is the zlib library, I got the following messages:


make -C mkcramfs install
BINDIR="/home/bernhard/axis/devboard_82/tools/build/bin"
make[2]: Entering directory
`/home/bernhard/axis/devboard_82/tools/build/mkcramfs'
gcc -Wall -Wshadow -I/home/bernhard/axis/devboard_82/target/host/include
-O0 -g -fno-omit-frame-pointer -I.
-L/home/bernhard/axis/devboard_82/target/host/lib  mkcramfs.c  -lz -o
mkcramfs
mkcramfs.c:40:18: zlib.h: No such file or directory
mkcramfs.c: In function `write_superblock':
mkcramfs.c:826: warning: implicit declaration of function `crc32'
mkcramfs.c:826: error: `Z_NULL' undeclared (first use in this function)
mkcramfs.c:826: error: (Each undeclared identifier is reported only once
mkcramfs.c:826: error: for each function it appears in.)
mkcramfs.c: In function `do_compress':
mkcramfs.c:1032: warning: implicit declaration of function `compress2'
mkcramfs.c:1032: error: `Z_BEST_COMPRESSION' undeclared (first use in
this function)
mkcramfs.c:1033: error: `Z_OK' undeclared (first use in this function)
mkcramfs.c:1034: warning: implicit declaration of function `zError'
mkcramfs.c: In function `main':
mkcramfs.c:1272: error: `Z_NULL' undeclared (first use in this function)
make[2]: *** [mkcramfs] Error 1
make[2]: Leaving directory
`/home/bernhard/axis/devboard_82/tools/build/mkcramfs'
make[1]: *** [mkcramfs] Error 2
make[1]: Leaving directory `/home/bernhard/axis/devboard_82/tools/build'
make: *** [tools] Error 2



Whats wrong here?


Best regards,

-- 
Bernhard Roessmann
Don't Fear The Penguins!